Target
Substance-P receptor
Ligand
BDBM21016
Substrate
Meas. Tech.
ChEMBL_205893 (CHEMBL813805)
IC50
3.24±n/a nM
Citation
 Takeuchi, YShands, EFBeusen, DDMarshall, GR Derivation of a three-dimensional pharmacophore model of substance P antagonists bound to the neurokinin-1 receptor. J Med Chem 41:3609-23 (1998)  
Target
Name:
Substance-P receptor
Synonyms:
NK-1 receptor NK1 Receptor NK1R_HUMAN Neurokinin-1 (NK-1) SPR TACR1 Tachykinin receptor 1 (NK1) | tachykinin
Type:
G Protein-Coupled Receptor (GPCR)
Mol. Mass.:
46254.43
Organism:
Homo sapiens (Human)
Description:
P25103
Residue:
407
  
Inhibitor
Name:
BDBM21016
Synonyms:
CHEMBL22870 L-732,138 N-acetyltryptophan 3,5-bis(trifluoromethyl)benzyl ester | [3,5-bis(trifluoromethyl)phenyl]methyl (2S)-2-acetamido-3-(1H-indol-3-yl)propanoate
Type:
Small organic molecule
Emp. Form.:
C22H18F6N2O3
Mol. Mass.:
472.3803
SMILES:
CC(=O)N[C@@H](Cc1c[nH]c2ccccc12)C(=O)OCc1cc(cc(c1)C(F)(F)F)C(F)(F)F
: