Target
Tubulin alpha-1A chain
Ligand
BDBM50059978
Substrate
Meas. Tech.
ChEMBL_212206 (CHEMBL817769)
IC50
776.25±n/a nM
Citation
 Zhang, SXFeng, JKuo, SCBrossi, AHamel, ETropsha, ALee, KH Antitumor agents. 199. Three-dimensional quantitative structure-activity relationship study of the colchicine binding site ligands using comparative molecular field analysis. J Med Chem 43:167-76 (2000)  
Target
Name:
Tubulin alpha-1A chain
Synonyms:
TBA1A_PIG Tubulin Tubulin alpha-1A chain
Type:
Protein
Mol. Mass.:
50049.25
Organism:
Sus scrofa (Pig)
Description:
P02550
Residue:
451
  
Inhibitor
Name:
BDBM50059978
Synonyms:
5,7-Dimethyl-2-naphthalen-1-yl-1H-[1,8]naphthyridin-4-one | CHEMBL49835
Type:
Small organic molecule
Emp. Form.:
C20H16N2O
Mol. Mass.:
300.3538
SMILES:
Cc1cc(C)c2c(O)cc(nc2n1)-c1cccc2ccccc12
: