Target
Tubulin alpha-1A chain
Ligand
BDBM50037462
Substrate
Meas. Tech.
ChEMBL_212206 (CHEMBL817769)
IC50
467.74±n/a nM
Citation
 Zhang, SXFeng, JKuo, SCBrossi, AHamel, ETropsha, ALee, KH Antitumor agents. 199. Three-dimensional quantitative structure-activity relationship study of the colchicine binding site ligands using comparative molecular field analysis. J Med Chem 43:167-76 (2000)  
Target
Name:
Tubulin alpha-1A chain
Synonyms:
TBA1A_PIG Tubulin Tubulin alpha-1A chain
Type:
Protein
Mol. Mass.:
50049.25
Organism:
Sus scrofa (Pig)
Description:
P02550
Residue:
451
  
Inhibitor
Name:
BDBM50037462
Synonyms:
6-(3-Hydroxy-phenyl)-5H-[1,3]dioxolo[4,5-g]quinolin-8-one | CHEMBL299143
Type:
Small organic molecule
Emp. Form.:
C16H11NO4
Mol. Mass.:
281.2628
SMILES:
Oc1cccc(c1)-c1cc(O)c2cc3OCOc3cc2n1
: