Target
Tubulin alpha-1A chain
Ligand
BDBM50059111
Substrate
Meas. Tech.
ChEMBL_212206 (CHEMBL817769)
IC50
794.33±n/a nM
Citation
 Zhang, SXFeng, JKuo, SCBrossi, AHamel, ETropsha, ALee, KH Antitumor agents. 199. Three-dimensional quantitative structure-activity relationship study of the colchicine binding site ligands using comparative molecular field analysis. J Med Chem 43:167-76 (2000)  
Target
Name:
Tubulin alpha-1A chain
Synonyms:
TBA1A_PIG Tubulin Tubulin alpha-1A chain
Type:
Protein
Mol. Mass.:
50049.25
Organism:
Sus scrofa (Pig)
Description:
P02550
Residue:
451
  
Inhibitor
Name:
BDBM50059111
Synonyms:
2-(3-Methoxy-phenyl)-6-methyl-1H-[1,8]naphthyridin-4-one | CHEMBL298378
Type:
Small organic molecule
Emp. Form.:
C16H14N2O2
Mol. Mass.:
266.2946
SMILES:
COc1cccc(c1)-c1cc(O)c2cc(C)cnc2n1
: