Target
Tubulin alpha-1A chain
Ligand
BDBM50037463
Substrate
Meas. Tech.
ChEMBL_212206 (CHEMBL817769)
IC50
363.08±n/a nM
Citation
 Zhang, SXFeng, JKuo, SCBrossi, AHamel, ETropsha, ALee, KH Antitumor agents. 199. Three-dimensional quantitative structure-activity relationship study of the colchicine binding site ligands using comparative molecular field analysis. J Med Chem 43:167-76 (2000)  
Target
Name:
Tubulin alpha-1A chain
Synonyms:
TBA1A_PIG Tubulin Tubulin alpha-1A chain
Type:
Protein
Mol. Mass.:
50049.25
Organism:
Sus scrofa (Pig)
Description:
P02550
Residue:
451
  
Inhibitor
Name:
BDBM50037463
Synonyms:
2-(3-Methoxy-phenyl)-6-morpholin-4-yl-1H-quinolin-4-one | CHEMBL50826
Type:
Small organic molecule
Emp. Form.:
C20H20N2O3
Mol. Mass.:
336.3844
SMILES:
COc1cccc(c1)-c1cc(O)c2cc(ccc2n1)N1CCOCC1
: