Target
Tubulin alpha-1A chain
Ligand
BDBM50056948
Substrate
Meas. Tech.
ChEMBL_212206 (CHEMBL817769)
IC50
562.34±n/a nM
Citation
 Zhang, SXFeng, JKuo, SCBrossi, AHamel, ETropsha, ALee, KH Antitumor agents. 199. Three-dimensional quantitative structure-activity relationship study of the colchicine binding site ligands using comparative molecular field analysis. J Med Chem 43:167-76 (2000)  
Target
Name:
Tubulin alpha-1A chain
Synonyms:
TBA1A_PIG Tubulin Tubulin alpha-1A chain
Type:
Protein
Mol. Mass.:
50049.25
Organism:
Sus scrofa (Pig)
Description:
P02550
Residue:
451
  
Inhibitor
Name:
BDBM50056948
Synonyms:
CHEMBL49847 Isonicotinic acid 1,2,3-trimethoxy-10-methylsulfanyl-9-oxo-5,6,7,9-tetrahydro-benzo[a]heptalen-7-yl ester
Type:
Small organic molecule
Emp. Form.:
C26H25NO6S
Mol. Mass.:
479.545
SMILES:
COc1cc2CC[C@H](OC(=O)c3ccncc3)c3cc(=O)c(SC)ccc3-c2c(OC)c1OC
: