Target
Tubulin alpha-1A chain
Ligand
BDBM50059103
Substrate
Meas. Tech.
ChEMBL_212206 (CHEMBL817769)
IC50
870.96±n/a nM
Citation
 Zhang, SXFeng, JKuo, SCBrossi, AHamel, ETropsha, ALee, KH Antitumor agents. 199. Three-dimensional quantitative structure-activity relationship study of the colchicine binding site ligands using comparative molecular field analysis. J Med Chem 43:167-76 (2000)  
Target
Name:
Tubulin alpha-1A chain
Synonyms:
TBA1A_PIG Tubulin Tubulin alpha-1A chain
Type:
Protein
Mol. Mass.:
50049.25
Organism:
Sus scrofa (Pig)
Description:
P02550
Residue:
451
  
Inhibitor
Name:
BDBM50059103
Synonyms:
2-(3-Methoxy-phenyl)-5,7-dimethyl-1H-[1,8]naphthyridin-4-one | CHEMBL48472
Type:
Small organic molecule
Emp. Form.:
C17H16N2O2
Mol. Mass.:
280.3211
SMILES:
COc1cccc(c1)-c1cc(O)c2c(C)cc(C)nc2n1
: