Target
Tubulin alpha-1A chain
Ligand
BDBM50037448
Substrate
Meas. Tech.
ChEMBL_212206 (CHEMBL817769)
IC50
380.19±n/a nM
Citation
 Zhang, SXFeng, JKuo, SCBrossi, AHamel, ETropsha, ALee, KH Antitumor agents. 199. Three-dimensional quantitative structure-activity relationship study of the colchicine binding site ligands using comparative molecular field analysis. J Med Chem 43:167-76 (2000)  
Target
Name:
Tubulin alpha-1A chain
Synonyms:
TBA1A_PIG Tubulin Tubulin alpha-1A chain
Type:
Protein
Mol. Mass.:
50049.25
Organism:
Sus scrofa (Pig)
Description:
P02550
Residue:
451
  
Inhibitor
Name:
BDBM50037448
Synonyms:
6-Dimethylamino-2-(3-methoxy-phenyl)-1H-quinolin-4-one | CHEMBL301589
Type:
Small organic molecule
Emp. Form.:
C18H18N2O2
Mol. Mass.:
294.3477
SMILES:
COc1cccc(c1)-c1cc(O)c2cc(ccc2n1)N(C)C
: