Target
Stromelysin-1
Ligand
BDBM50084744
Substrate
Meas. Tech.
ChEMBL_104886 (CHEMBL709184)
IC50
18±n/a nM
Citation
 Ambrose Amin, EWelsh, WJ Three-dimensional quantitative structure-activity relationship (3D-QSAR) models for a novel class of piperazine-based stromelysin-1 (MMP-3) inhibitors: applying a"divide and conquer" strategy. J Med Chem 44:3849-55 (2001)  
Target
Name:
Stromelysin-1
Synonyms:
MMP-3 MMP3_HUMAN Matrix metalloproteinase 3 Matrix metalloproteinase-3 (MMP-3) SL-1 Stromelysin 1 | Transin-1
Type:
Enzyme
Mol. Mass.:
53973.13
Organism:
Homo sapiens (Human)
Description:
P08254
Residue:
477
  
Inhibitor
Name:
BDBM50084744
Synonyms:
3-Hydroxycarbamoyl-4-(4-methoxy-benzenesulfonyl)-piperazine-1-carboxylic acid benzyl ester | CHEMBL332134
Type:
Small organic molecule
Emp. Form.:
C20H23N3O7S
Mol. Mass.:
449.478
SMILES:
COc1ccc(cc1)S(=O)(=O)N1CCN(CC1C(=O)NO)C(=O)OCc1ccccc1
: