Target
Integrase
Ligand
BDBM50409861
Substrate
Meas. Tech.
ChEMBL_88771 (CHEMBL701803)
IC50
1412.54±n/a nM
Citation
 Kuo, CLAssefa, HKamath, SBrzozowski, ZSlawinski, JSaczewski, FBuolamwini, JKNeamati, N Application of CoMFA and CoMSIA 3D-QSAR and docking studies in optimization of mercaptobenzenesulfonamides as HIV-1 integrase inhibitors. J Med Chem 47:385-99 (2004)  
Target
Name:
Integrase
Synonyms:
Human immunodeficiency virus type 1 integrase
Type:
PROTEIN
Mol. Mass.:
32231.48
Organism:
Human immunodeficiency virus 1
Description:
ChEMBL_90865
Residue:
288
  
Inhibitor
Name:
BDBM50409861
Synonyms:
CHEMBL129486
Type:
Small organic molecule
Emp. Form.:
C13H10N4O3S3
Mol. Mass.:
366.439
SMILES:
Oc1nc(S)sc1NS(=O)(=O)c1ccc(cc1)-c1ncccn1
: