Target
Integrase
Ligand
BDBM50409866
Substrate
Meas. Tech.
ChEMBL_88771 (CHEMBL701803)
IC50
7413.1±n/a nM
Citation
 Kuo, CLAssefa, HKamath, SBrzozowski, ZSlawinski, JSaczewski, FBuolamwini, JKNeamati, N Application of CoMFA and CoMSIA 3D-QSAR and docking studies in optimization of mercaptobenzenesulfonamides as HIV-1 integrase inhibitors. J Med Chem 47:385-99 (2004)  
Target
Name:
Integrase
Synonyms:
Human immunodeficiency virus type 1 integrase
Type:
PROTEIN
Mol. Mass.:
32231.48
Organism:
Human immunodeficiency virus 1
Description:
ChEMBL_90865
Residue:
288
  
Inhibitor
Name:
BDBM50409866
Synonyms:
CHEMBL337606
Type:
Small organic molecule
Emp. Form.:
C17H13ClN4O2S2
Mol. Mass.:
404.894
SMILES:
Cc1cc(c(S)cc1Cl)S(=O)(=O)Nc1nnc2ccc3ccccc3n12
: