Target
Integrase
Ligand
BDBM50409882
Substrate
Meas. Tech.
ChEMBL_88770 (CHEMBL701802)
IC50
15488.17±n/a nM
Citation
 Kuo, CLAssefa, HKamath, SBrzozowski, ZSlawinski, JSaczewski, FBuolamwini, JKNeamati, N Application of CoMFA and CoMSIA 3D-QSAR and docking studies in optimization of mercaptobenzenesulfonamides as HIV-1 integrase inhibitors. J Med Chem 47:385-99 (2004)  
Target
Name:
Integrase
Synonyms:
Human immunodeficiency virus type 1 integrase
Type:
PROTEIN
Mol. Mass.:
32231.48
Organism:
Human immunodeficiency virus 1
Description:
ChEMBL_90865
Residue:
288
  
Inhibitor
Name:
BDBM50409882
Synonyms:
CHEMBL339576
Type:
Small organic molecule
Emp. Form.:
C16H16ClN5O3S2
Mol. Mass.:
425.913
SMILES:
COc1ccc(Nc2nnc(NS(=O)(=O)c3cc(C)c(Cl)cc3S)[nH]2)cc1
: