Target
Gonadotropin-releasing hormone receptor
Ligand
BDBM50409919
Substrate
Meas. Tech.
ChEMBL_100151 (CHEMBL712508)
Ki
0.11±n/a nM
Citation
 Randolph, JTWaid, PNichols, CSauer, DHaviv, FDiaz, GBammert, GBesecke, LMSegreti, JAMohning, KMBush, ENWegner, CDGreer, J Nonpeptide luteinizing hormone-releasing hormone antagonists derived from erythromycin A: design, synthesis, and biological activity of cladinose replacement analogues. J Med Chem 47:1085-97 (2004)  
Target
Name:
Gonadotropin-releasing hormone receptor
Synonyms:
GNRHR_RAT GnRH-R | Gnrhr
Type:
PROTEIN
Mol. Mass.:
37767.60
Organism:
Rattus norvegicus
Description:
ChEMBL_1335047
Residue:
327
  
Inhibitor
Name:
BDBM50409919
Synonyms:
CHEMBL12282
Type:
Small organic molecule
Emp. Form.:
C47H69ClFN3O13
Mol. Mass.:
938.514
SMILES:
CC[C@H]1OC(=O)[C@H](C)[C@@H](OC(=O)N2[C@@H](C)COC2=O)[C@H](C)[C@@H](OC2O[C@H](C)C[C@@H]([C@H]2O)N(C)CC2CC2)[C@](C)(C[C@@H](C)C(=O)[C@H](C)[C@H]2N(CCc3ccc(F)c(Cl)c3)C(=O)O[C@]12C)OC
: