Target
Tryptase beta-2
Ligand
BDBM50187800
Substrate
Meas. Tech.
ChEMBL_370996 (CHEMBL868494)
Ki
5.4±n/a nM
Citation
 Palmer, JTRydzewski, RMMendonca, RVSperandio, DSpencer, JRHirschbein, BLLohman, JBeltman, JNguyen, MLiu, L Design and synthesis of selective keto-1,2,4-oxadiazole-based tryptase inhibitors. Bioorg Med Chem Lett 16:3434-9 (2006)  
Target
Name:
Tryptase beta-2
Synonyms:
TPS2 TRYB2_HUMAN Tryptase II Tryptase-2
Type:
PROTEIN
Mol. Mass.:
30518.79
Organism:
Homo sapiens (Human)
Description:
ChEMBL_210702
Residue:
275
  
Inhibitor
Name:
BDBM50187800
Synonyms:
(S)-ethyl 1-(5-(4-phenethoxybenzyl)-1,2,4-oxadiazol-3-yl)-6-amino-1-oxohexan-2-ylcarbamate | CHEMBL211561
Type:
Small organic molecule
Emp. Form.:
C26H32N4O5
Mol. Mass.:
480.5561
SMILES:
CCOC(=O)N[C@@H](CCCCN)C(=O)c1noc(Cc2ccc(OCCc3ccccc3)cc2)n1
: