Target
Urotensin-2 receptor
Ligand
BDBM50002727
Substrate
Meas. Tech.
ChEMBL_412858 (CHEMBL910631)
Ki
3±n/a nM
Citation
 Chatenet, DDubessy, CBoularan, CScalbert, EPfeiffer, BRenard, PLihrmann, IPacaud, PTonon, MCVaudry, HLeprince, J Structure-activity relationships of a novel series of urotensin II analogues: identification of a urotensin II antagonist. J Med Chem 49:7234-8 (2006)  
Target
Name:
Urotensin-2 receptor
Synonyms:
G-protein coupled receptor 14 UR-II-R UTS2R Urotensin-II
Type:
Enzyme Catalytic Domain
Mol. Mass.:
42159.71
Organism:
Homo sapiens (Human)
Description:
Urotensin-II UTS2R HUMAN::Q9UKP6
Residue:
389
  
Inhibitor
Name:
BDBM50002727
Synonyms:
CHEMBL266651
Type:
Small organic molecule
Emp. Form.:
C51H66N10O12S2
Mol. Mass.:
1075.26
SMILES:
CC(C)[C@H](NC(=O)[C@@H]1CSSC[C@H](NC(=O)[C@@H](N)CCC(O)=O)C(=O)N[C@@H](Cc2ccccc2)C(=O)N[C@@H](Cc2c[nH]c3ccccc23)C(=O)N[C@@H](CCCCN)C(=O)N[C@@H](Cc2ccc(O)cc2)C(=O)N1)C(O)=O
: