Target
Salicyl-AMP ligase / salicyl-S-ArCP synthetase
Ligand
BDBM50411241
Substrate
Meas. Tech.
ChEMBL_423930 (CHEMBL911945)
Ki
3.2±n/a nM
Citation
 Somu, RVWilson, DJBennett, EMBoshoff, HICelia, LBeck, BJBarry, CEAldrich, CC Antitubercular nucleosides that inhibit siderophore biosynthesis: SAR of the glycosyl domain. J Med Chem 49:7623-35 (2006)  
Target
Name:
Salicyl-AMP ligase / salicyl-S-ArCP synthetase
Synonyms:
2,3-dihydroxybenzoate-AMP ligase mbtA
Type:
PROTEIN
Mol. Mass.:
59275.32
Organism:
Mycobacterium tuberculosis
Description:
ChEMBL_423930
Residue:
565
  
Inhibitor
Name:
BDBM50411241
Synonyms:
CHEMBL387162
Type:
Small organic molecule
Emp. Form.:
C17H18N6O7S
Mol. Mass.:
450.426
SMILES:
Nc1ncnc2ncn([C@@H]3O[C@H](COS(=O)(=O)NC(=O)c4ccccc4O)C[C@H]3O)c12
: