Target
Salicyl-AMP ligase / salicyl-S-ArCP synthetase
Ligand
BDBM50411456
Substrate
Meas. Tech.
ChEMBL_451657 (CHEMBL901868)
Ki
14±n/a nM
Citation
 Qiao, CGupte, ABoshoff, HIWilson, DJBennett, EMSomu, RVBarry, CEAldrich, CC 5'-O-[(N-acyl)sulfamoyl]adenosines as antitubercular agents that inhibit MbtA: an adenylation enzyme required for siderophore biosynthesis of the mycobactins. J Med Chem 50:6080-94 (2007)  
Target
Name:
Salicyl-AMP ligase / salicyl-S-ArCP synthetase
Synonyms:
2,3-dihydroxybenzoate-AMP ligase mbtA
Type:
PROTEIN
Mol. Mass.:
59275.32
Organism:
Mycobacterium tuberculosis
Description:
ChEMBL_423930
Residue:
565
  
Inhibitor
Name:
BDBM50411456
Synonyms:
CHEMBL1162037
Type:
Small organic molecule
Emp. Form.:
C18H20N6O8S
Mol. Mass.:
480.452
SMILES:
Cc1ccc(C(=O)NS(=O)(=O)OC[C@H]2O[C@H]([C@H](O)[C@@H]2O)n2cnc3c(N)ncnc23)c(O)c1
: