Target
Salicyl-AMP ligase / salicyl-S-ArCP synthetase
Ligand
BDBM50411458
Substrate
Meas. Tech.
ChEMBL_451657 (CHEMBL901868)
Ki
92±n/a nM
Citation
 Qiao, CGupte, ABoshoff, HIWilson, DJBennett, EMSomu, RVBarry, CEAldrich, CC 5'-O-[(N-acyl)sulfamoyl]adenosines as antitubercular agents that inhibit MbtA: an adenylation enzyme required for siderophore biosynthesis of the mycobactins. J Med Chem 50:6080-94 (2007)  
Target
Name:
Salicyl-AMP ligase / salicyl-S-ArCP synthetase
Synonyms:
2,3-dihydroxybenzoate-AMP ligase mbtA
Type:
PROTEIN
Mol. Mass.:
59275.32
Organism:
Mycobacterium tuberculosis
Description:
ChEMBL_423930
Residue:
565
  
Inhibitor
Name:
BDBM50411458
Synonyms:
CHEMBL438072
Type:
Small organic molecule
Emp. Form.:
C17H18N6O7S
Mol. Mass.:
450.426
SMILES:
Nc1ncnc2n(cnc12)[C@@H]1O[C@H](COS(=O)(=O)NC(=O)c2ccccc2)[C@@H](O)[C@H]1O
: