Target
Salicyl-AMP ligase / salicyl-S-ArCP synthetase
Ligand
BDBM50411471
Substrate
Meas. Tech.
ChEMBL_451657 (CHEMBL901868)
Ki
770±n/a nM
Citation
 Qiao, CGupte, ABoshoff, HIWilson, DJBennett, EMSomu, RVBarry, CEAldrich, CC 5'-O-[(N-acyl)sulfamoyl]adenosines as antitubercular agents that inhibit MbtA: an adenylation enzyme required for siderophore biosynthesis of the mycobactins. J Med Chem 50:6080-94 (2007)  
Target
Name:
Salicyl-AMP ligase / salicyl-S-ArCP synthetase
Synonyms:
2,3-dihydroxybenzoate-AMP ligase mbtA
Type:
PROTEIN
Mol. Mass.:
59275.32
Organism:
Mycobacterium tuberculosis
Description:
ChEMBL_423930
Residue:
565
  
Inhibitor
Name:
BDBM50411471
Synonyms:
CHEMBL437891
Type:
Small organic molecule
Emp. Form.:
C17H19N7O7S
Mol. Mass.:
465.44
SMILES:
Nc1ccccc1C(=O)NS(=O)(=O)OC[C@H]1O[C@H]([C@H](O)[C@@H]1O)n1cnc2c(N)ncnc12
: