Target
cGMP-specific 3',5'-cyclic phosphodiesterase
Ligand
BDBM50027727
Substrate
Meas. Tech.
ChEMBL_456375 (CHEMBL906422)
IC50
0.347±n/a nM
Citation
 Yoo, JThai, KMKim, DKLee, JYPark, HJ 3D-QSAR studies on sildenafil analogues, selective phosphodiesterase 5 inhibitors. Bioorg Med Chem Lett 17:4271-4 (2007)  
Target
Name:
cGMP-specific 3',5'-cyclic phosphodiesterase
Synonyms:
3',5'-cyclic phosphodiesterase PDE5 PDE5A_HUMAN Phosphodiesterase 5 (PDE5) Phosphodiesterase 5A (PDE5A) cGMP-specific 3',5'-cyclic phosphodiesterase
Type:
Protein
Mol. Mass.:
99975.83
Organism:
Homo sapiens (Human)
Description:
O76074
Residue:
875
  
Inhibitor
Name:
BDBM50027727
Synonyms:
CHEMBL246743
Type:
Small organic molecule
Emp. Form.:
C22H29N5O3
Mol. Mass.:
411.4974
SMILES:
CCCOc1ccc(NC(=O)C(C)C)cc1-c1nc2c(CCC)nn(C)c2c(=O)[nH]1
: