Target
cGMP-specific 3',5'-cyclic phosphodiesterase
Ligand
BDBM50241308
Substrate
Meas. Tech.
ChEMBL_456375 (CHEMBL906422)
IC50
0.933±n/a nM
Citation
 Yoo, JThai, KMKim, DKLee, JYPark, HJ 3D-QSAR studies on sildenafil analogues, selective phosphodiesterase 5 inhibitors. Bioorg Med Chem Lett 17:4271-4 (2007)  
Target
Name:
cGMP-specific 3',5'-cyclic phosphodiesterase
Synonyms:
3',5'-cyclic phosphodiesterase PDE5 PDE5A_HUMAN Phosphodiesterase 5 (PDE5) Phosphodiesterase 5A (PDE5A) cGMP-specific 3',5'-cyclic phosphodiesterase
Type:
Protein
Mol. Mass.:
99975.83
Organism:
Homo sapiens (Human)
Description:
O76074
Residue:
875
  
Inhibitor
Name:
BDBM50241308
Synonyms:
(2-{4-[3-(1-Methyl-7-oxo-3-propyl-6,7-dihydro-1H-pyrazolo[4,3-d]pyrimidin-5-yl)-4-propoxy-benzenesulfonyl]-piperazin-1-yl}-ethyl)-phosphonic acid CHEMBL245721
Type:
Small organic molecule
Emp. Form.:
C24H35N6O7PS
Mol. Mass.:
582.609
SMILES:
CCCOc1ccc(cc1-c1nc2c(CCC)nn(C)c2c(=O)[nH]1)S(=O)(=O)N1CCN(CCP(O)(O)=O)CC1
: