Target
Muscarinic acetylcholine receptor M3
Ligand
BDBM50412313
Substrate
Meas. Tech.
ChEMBL_491020 (CHEMBL982068)
Ki
48.98±n/a nM
Citation
 Minarini, AMarucci, GBellucci, CGiorgi, GTumiatti, VBolognesi, MLMatera, RRosini, MMelchiorre, C Design, synthesis, and biological evaluation of pirenzepine analogs bearing a 1,2-cyclohexanediamine and perhydroquinoxaline units in exchange for the piperazine ring as antimuscarinics. Bioorg Med Chem 16:7311-20 (2008)  
Target
Name:
Muscarinic acetylcholine receptor M3
Synonyms:
ACM3_HUMAN Cholinergic, muscarinic M3 Muscarinic receptor M3 | RecName: Full=Muscarinic acetylcholine receptor M3
Type:
Enzyme
Mol. Mass.:
66151.03
Organism:
Homo sapiens (Human)
Description:
P20309
Residue:
590
  
Inhibitor
Name:
BDBM50412313
Synonyms:
CHEMBL2021478
Type:
Small organic molecule
Emp. Form.:
C24H30N4O2
Mol. Mass.:
406.5206
SMILES:
CN(C)[C@@H]1CCCC[C@@H]1N(C)CC(=O)N1c2ccccc2NC(=O)c2ccccc12
: