Target
D(1A) dopamine receptor
Ligand
BDBM50219137
Substrate
Meas. Tech.
ChEMBL_491079 (CHEMBL982102)
Ki
2.67±n/a nM
Citation
 Enzensperger, CGörnemann, TPertz, HHLehmann, J Dopamine/serotonin receptor ligands. Part 17: a cross-target SAR approach: affinities of azecine-styled ligands for 5-HT(2A) versus D1 and D2 receptors. Bioorg Med Chem Lett 18:3809-13 (2008)  
Target
Name:
D(1A) dopamine receptor
Synonyms:
DA D1 receptor DRD1 Dopamine D1 receptor Dopamine D1A
Type:
Enzyme
Mol. Mass.:
49303.43
Organism:
Homo sapiens (Human)
Description:
P21728
Residue:
446
  
Inhibitor
Name:
BDBM50219137
Synonyms:
7-methyl-6,7,8,9,10,15-hexahydro-5H-dibenzo[d,g]azacycloundecene-3-ol CHEMBL231070
Type:
Small organic molecule
Emp. Form.:
C19H23NO
Mol. Mass.:
281.392
SMILES:
CN1CCCc2ccccc2Cc2ccc(O)cc2CC1
: