Target
D(1A) dopamine receptor
Ligand
BDBM50180925
Substrate
Meas. Tech.
ChEMBL_491079 (CHEMBL982102)
Ki
3.47±n/a nM
Citation
 Enzensperger, CGörnemann, TPertz, HHLehmann, J Dopamine/serotonin receptor ligands. Part 17: a cross-target SAR approach: affinities of azecine-styled ligands for 5-HT(2A) versus D1 and D2 receptors. Bioorg Med Chem Lett 18:3809-13 (2008)  
Target
Name:
D(1A) dopamine receptor
Synonyms:
DA D1 receptor DRD1 Dopamine D1 receptor Dopamine D1A
Type:
Enzyme
Mol. Mass.:
49303.43
Organism:
Homo sapiens (Human)
Description:
P21728
Residue:
446
  
Inhibitor
Name:
BDBM50180925
Synonyms:
11-methyl-11-aza-tricyclo[12.4.0.03,8]octadeca-1(18),3(8),4,6,14,16-hexaene CHEMBL201525
Type:
Small organic molecule
Emp. Form.:
C18H21N
Mol. Mass.:
251.366
SMILES:
CN1CCc2ccccc2Cc2ccccc2CC1
: