Target
D(1A) dopamine receptor
Ligand
BDBM50184428
Substrate
Meas. Tech.
ChEMBL_491079 (CHEMBL982102)
Ki
0.813±n/a nM
Citation
 Enzensperger, CGörnemann, TPertz, HHLehmann, J Dopamine/serotonin receptor ligands. Part 17: a cross-target SAR approach: affinities of azecine-styled ligands for 5-HT(2A) versus D1 and D2 receptors. Bioorg Med Chem Lett 18:3809-13 (2008)  
Target
Name:
D(1A) dopamine receptor
Synonyms:
DA D1 receptor DRD1 Dopamine D1 receptor Dopamine D1A
Type:
Enzyme
Mol. Mass.:
49303.43
Organism:
Homo sapiens (Human)
Description:
P21728
Residue:
446
  
Inhibitor
Name:
BDBM50184428
Synonyms:
4-Chloro-3-hydroxy-7-methyl-5,6,7,8,9,14-hexahydrodibenzo[d,g]azecine CHEMBL203637
Type:
Small organic molecule
Emp. Form.:
C18H20ClNO
Mol. Mass.:
301.811
SMILES:
CN1CCc2ccccc2Cc2ccc(O)c(Cl)c2CC1
: