Target
Salicyl-AMP ligase / salicyl-S-ArCP synthetase
Ligand
BDBM50412840
Substrate
Meas. Tech.
ChEMBL_496141 (CHEMBL999364)
Ki
5.1±n/a nM
Citation
 Gupte, ABoshoff, HIWilson, DJNeres, JLabello, NPSomu, RVXing, CBarry, CEAldrich, CC Inhibition of siderophore biosynthesis by 2-triazole substituted analogues of 5'-O-[N-(salicyl)sulfamoyl]adenosine: antibacterial nucleosides effective against Mycobacterium tuberculosis. J Med Chem 51:7495-507 (2009)  
Target
Name:
Salicyl-AMP ligase / salicyl-S-ArCP synthetase
Synonyms:
2,3-dihydroxybenzoate-AMP ligase mbtA
Type:
PROTEIN
Mol. Mass.:
59275.32
Organism:
Mycobacterium tuberculosis
Description:
ChEMBL_423930
Residue:
565
  
Inhibitor
Name:
BDBM50412840
Synonyms:
CHEMBL612046
Type:
Small organic molecule
Emp. Form.:
C17H17N9O8S
Mol. Mass.:
507.437
SMILES:
Nc1nc(N=[N+]=[N-])nc2n(cnc12)C1OC(COS(=O)(=O)NC(=O)c2ccccc2O)C(O)C1O
: