Target
Amine oxidase [flavin-containing] A
Ligand
BDBM50412883
Substrate
Meas. Tech.
ChEMBL_515032 (CHEMBL980843)
IC50
10000±n/a nM
Citation
 Chimenti, FFioravanti, RBolasco, AManna, FChimenti, PSecci, DRossi, FTurini, POrtuso, FAlcaro, SCardia, MC Synthesis, molecular modeling studies and selective inhibitory activity against MAO of N1-propanoyl-3,5-diphenyl-4,5-dihydro-(1H)-pyrazole derivatives. Eur J Med Chem 43:2262-7 (2008)  
Target
Name:
Amine oxidase [flavin-containing] A
Synonyms:
AOFA_BOVIN MAO-A Monoamine Oxidase Type A (MAO-A) Monoamine oxidase A | Monoamine oxidase type A
Type:
PROTEIN
Mol. Mass.:
59764.63
Organism:
Bos taurus
Description:
ChEMBL_1501477
Residue:
527
  
Inhibitor
Name:
BDBM50412883
Synonyms:
CHEMBL472902
Type:
Small organic molecule
Emp. Form.:
C19H19FN2O
Mol. Mass.:
310.3654
SMILES:
CCC(=O)N1N=C(CC1c1ccc(C)cc1)c1ccc(F)cc1
: