Target
Amine oxidase [flavin-containing] A
Ligand
BDBM50412894
Substrate
Meas. Tech.
ChEMBL_515032 (CHEMBL980843)
IC50
1174.9±n/a nM
Citation
 Chimenti, FFioravanti, RBolasco, AManna, FChimenti, PSecci, DRossi, FTurini, POrtuso, FAlcaro, SCardia, MC Synthesis, molecular modeling studies and selective inhibitory activity against MAO of N1-propanoyl-3,5-diphenyl-4,5-dihydro-(1H)-pyrazole derivatives. Eur J Med Chem 43:2262-7 (2008)  
Target
Name:
Amine oxidase [flavin-containing] A
Synonyms:
AOFA_BOVIN MAO-A Monoamine Oxidase Type A (MAO-A) Monoamine oxidase A | Monoamine oxidase type A
Type:
PROTEIN
Mol. Mass.:
59764.63
Organism:
Bos taurus
Description:
ChEMBL_1501477
Residue:
527
  
Inhibitor
Name:
BDBM50412894
Synonyms:
CHEMBL523765
Type:
Small organic molecule
Emp. Form.:
C20H22N2O3
Mol. Mass.:
338.4003
SMILES:
CCC(=O)N1N=C(CC1c1ccc(OC)cc1)c1ccc(OC)cc1
: