Target
Amine oxidase [flavin-containing] A
Ligand
BDBM50110725
Substrate
Meas. Tech.
ChEMBL_515032 (CHEMBL980843)
IC50
380.19±n/a nM
Citation
 Chimenti, FFioravanti, RBolasco, AManna, FChimenti, PSecci, DRossi, FTurini, POrtuso, FAlcaro, SCardia, MC Synthesis, molecular modeling studies and selective inhibitory activity against MAO of N1-propanoyl-3,5-diphenyl-4,5-dihydro-(1H)-pyrazole derivatives. Eur J Med Chem 43:2262-7 (2008)  
Target
Name:
Amine oxidase [flavin-containing] A
Synonyms:
AOFA_BOVIN MAO-A Monoamine Oxidase Type A (MAO-A) Monoamine oxidase A | Monoamine oxidase type A
Type:
PROTEIN
Mol. Mass.:
59764.63
Organism:
Bos taurus
Description:
ChEMBL_1501477
Residue:
527
  
Inhibitor
Name:
BDBM50110725
Synonyms:
5-(hydroxymethyl)-3-(3-methylphenyl)-oxazolidin-2-one CHEMBL18116 Taloxotone
Type:
Small organic molecule
Emp. Form.:
C11H13NO3
Mol. Mass.:
207.2258
SMILES:
Cc1cccc(c1)N1CC(CO)OC1=O
: