Target
Amine oxidase [flavin-containing] B
Ligand
BDBM50412891
Substrate
Meas. Tech.
ChEMBL_515302 (CHEMBL1035637)
IC50
851.14±n/a nM
Citation
 Chimenti, FFioravanti, RBolasco, AManna, FChimenti, PSecci, DRossi, FTurini, POrtuso, FAlcaro, SCardia, MC Synthesis, molecular modeling studies and selective inhibitory activity against MAO of N1-propanoyl-3,5-diphenyl-4,5-dihydro-(1H)-pyrazole derivatives. Eur J Med Chem 43:2262-7 (2008)  
Target
Name:
Amine oxidase [flavin-containing] B
Synonyms:
AOFB_BOVIN MAO-B Monoamine Oxidase Type B (MAO-B) Monoamine oxidase B | Monoamine oxidase type B
Type:
PROTEIN
Mol. Mass.:
58428.94
Organism:
Bos taurus
Description:
ChEMBL_1501478
Residue:
520
  
Inhibitor
Name:
BDBM50412891
Synonyms:
CHEMBL489085
Type:
Small organic molecule
Emp. Form.:
C19H19ClN2O2
Mol. Mass.:
342.819
SMILES:
CCC(=O)N1N=C(CC1c1ccc(Cl)cc1)c1ccc(OC)cc1
: