Target
Mas-related G-protein coupled receptor member X1
Ligand
BDBM50412999
Substrate
Meas. Tech.
ChEMBL_516621 (CHEMBL991397)
EC50
132±n/a nM
Citation
 Wroblowski, BWigglesworth, MJSzekeres, PGSmith, GDRahman, SSNicholson, NHMuir, AIHall, AHeer, JPGarland, SLCoates, WJ The discovery of a selective, small molecule agonist for the MAS-related gene X1 receptor. J Med Chem 52:818-25 (2009)  
Target
Name:
Mas-related G-protein coupled receptor member X1
Synonyms:
MRGPRX1 MRGX1_HUMAN SNSR4
Type:
PROTEIN
Mol. Mass.:
36253.68
Organism:
Homo sapiens (Human)
Description:
ChEMBL_516621
Residue:
322
  
Inhibitor
Name:
BDBM50412999
Synonyms:
CHEMBL449189
Type:
Small organic molecule
Emp. Form.:
C32H29ClN6O2
Mol. Mass.:
565.065
SMILES:
Cc1c(Cn2ncc(N3CCNCC3)c(Cl)c2=O)cccc1NC(=O)c1ccc(cc1)-c1ccc2ncccc2c1
: