Target
5-hydroxytryptamine receptor 1B
Ligand
BDBM50413083
Substrate
Meas. Tech.
ChEMBL_492739 (CHEMBL938539)
Ki
0.316±n/a nM
Citation
 Bromidge, SMBertani, BBorriello, MFaedo, SGordon, LJGranci, EHill, MMarshall, HRStasi, LPZucchelli, VMerlo, GVesentini, AWatson, JMZonzini, L 6-[2-(4-Aryl-1-piperazinyl)ethyl]-2H-1,4-benzoxazin-3(4H)-ones: dual-acting 5-HT1 receptor antagonists and serotonin reuptake inhibitors. Bioorg Med Chem Lett 18:5653-6 (2008)  
Target
Name:
5-hydroxytryptamine receptor 1B
Synonyms:
5-HT-1B 5-HT1B 5HT1B_HUMAN HTR1DB Serotonin (5-HT) receptor Serotonin Receptor 1B
Type:
G Protein-Coupled Receptor (GPCR)
Mol. Mass.:
43579.17
Organism:
Homo sapiens (Human)
Description:
Receptor binding assays were performed using human clone stably expressed in CHO cells
Residue:
390
  
Inhibitor
Name:
BDBM50413083
Synonyms:
CHEMBL484059
Type:
Small organic molecule
Emp. Form.:
C29H28N4O2
Mol. Mass.:
464.5582
SMILES:
O=C1COc2ccc(CCN3CCN(CC3)c3cccc4nc(ccc34)-c3ccccc3)cc2N1
: