Target
Cytochrome P450 2A5
Ligand
BDBM50159262
Substrate
Meas. Tech.
ChEMBL_572014 (CHEMBL1023676)
IC50
4797±n/a nM
Citation
 Roy, KRoy, PP Exploring QSAR and QAAR for inhibitors of cytochrome P450 2A6 and 2A5 enzymes using GFA and G/PLS techniques. Eur J Med Chem 44:1941-51 (2009)  
Target
Name:
Cytochrome P450 2A5
Synonyms:
CP2A5_MOUSE Cyp2a5
Type:
PROTEIN
Mol. Mass.:
56752.73
Organism:
Mus musculus
Description:
ChEMBL_572014
Residue:
494
  
Inhibitor
Name:
BDBM50159262
Synonyms:
3-Methyl-isoquinoline CHEMBL191667
Type:
Small organic molecule
Emp. Form.:
C10H9N
Mol. Mass.:
143.1852
SMILES:
Cc1cc2ccccc2cn1
: