Target
Cannabinoid receptor 1
Ligand
BDBM50335950
Substrate
Meas. Tech.
ChEMBL_570538 (CHEMBL1026910)
Ki
1.3±n/a nM
Citation
 De Freitas, GBda Silva, LLRomeiro, NCFraga, CA Development of CoMFA and CoMSIA models of affinity and selectivity for indole ligands of cannabinoid CB1 and CB2 receptors. Eur J Med Chem 44:2482-96 (2009)  
Target
Name:
Cannabinoid receptor 1
Synonyms:
Brain-type cannabinoid receptor CB-R CNR1_RAT Cannabinoid receptor Cnr1 | Skr6
Type:
G Protein-Coupled Receptor (GPCR)
Mol. Mass.:
52856.55
Organism:
Rattus norvegicus (rat)
Description:
P20272
Residue:
473
  
Inhibitor
Name:
BDBM50335950
Synonyms:
(2-methyl-1-pentyl-1H-indol-3-yl)(4,6,7-trimethyl-2-propylnaphthalen-1-yl)methanone CHEMBL564901 | JWH-181
Type:
Small organic molecule
Emp. Form.:
C28H31NO
Mol. Mass.:
397.5518
SMILES:
CCCCCn1c(C)c(C(=O)c2ccc(CCC)c3ccccc23)c2ccccc12
: