Target
Cannabinoid receptor 2
Ligand
BDBM21282
Substrate
Meas. Tech.
ChEMBL_570539 (CHEMBL1026911)
Ki
13.8±n/a nM
Citation
 De Freitas, GBda Silva, LLRomeiro, NCFraga, CA Development of CoMFA and CoMSIA models of affinity and selectivity for indole ligands of cannabinoid CB1 and CB2 receptors. Eur J Med Chem 44:2482-96 (2009)  
Target
Name:
Cannabinoid receptor 2
Synonyms:
CANNABINOID CB2 CB2 CB2B CNR2_HUMAN Cannabinoid CB2 receptor Cannabinoid receptor 2 (CB2R) | hCB2
Type:
G Protein-Coupled Receptor (GPCR)
Mol. Mass.:
39690.94
Organism:
Homo sapiens (Human)
Description:
P34972
Residue:
360
  
Inhibitor
Name:
BDBM21282
Synonyms:
2-methyl-3-(naphthalen-1-ylcarbonyl)-1-propyl-1H-indole JWH-015
Type:
Emp. Form.:
C23H21NO
Mol. Mass.:
327.4189
SMILES:
CCCn1c(C)c(C(=O)c2cccc3ccccc23)c2ccccc12
: