Target
Cannabinoid receptor 2
Ligand
BDBM50414063
Substrate
Meas. Tech.
ChEMBL_570539 (CHEMBL1026911)
Ki
0.49±n/a nM
Citation
 De Freitas, GBda Silva, LLRomeiro, NCFraga, CA Development of CoMFA and CoMSIA models of affinity and selectivity for indole ligands of cannabinoid CB1 and CB2 receptors. Eur J Med Chem 44:2482-96 (2009)  
Target
Name:
Cannabinoid receptor 2
Synonyms:
CANNABINOID CB2 CB2 CB2B CNR2_HUMAN Cannabinoid CB2 receptor Cannabinoid receptor 2 (CB2R) | hCB2
Type:
G Protein-Coupled Receptor (GPCR)
Mol. Mass.:
39690.94
Organism:
Homo sapiens (Human)
Description:
P34972
Residue:
360
  
Inhibitor
Name:
BDBM50414063
Synonyms:
CHEMBL564066 | JWH-048
Type:
Small organic molecule
Emp. Form.:
C26H27NO
Mol. Mass.:
369.4987
SMILES:
CCCCCn1c(C)c(C(=O)c2cccc3ccc(C)cc23)c2ccccc12
: