Target
Urokinase-type plasminogen activator
Ligand
BDBM16173
Substrate
Meas. Tech.
ChEMBL_570757 (CHEMBL1026932)
Ki
2512±n/a nM
Citation
 Brown, SPMuchmore, SW Large-scale application of high-throughput molecular mechanics with Poisson-Boltzmann surface area for routine physics-based scoring of protein-ligand complexes. J Med Chem 52:3159-65 (2009)  
Target
Name:
Urokinase-type plasminogen activator
Synonyms:
3.4.21.73 U-plasminogen activator Urokinase Urokinase-type plasminogen activator chain B Urokinase-type plasminogen activator short chain A uPA
Type:
Enzyme
Mol. Mass.:
48528.62
Organism:
Homo sapiens (Human)
Description:
P00749
Residue:
431
  
Inhibitor
Name:
BDBM16173
Synonyms:
3,5-diamino-6-chloro-N-(diaminomethylene)pyrazinamide;hydrochloride Amiloride CHEMBL945
Type:
Small organic molecule
Emp. Form.:
C6H8ClN7O
Mol. Mass.:
229.627
SMILES:
NC(=N)NC(=O)c1nc(Cl)c(N)nc1N
: