Target
Alpha-1A adrenergic receptor
Ligand
BDBM50414397
Substrate
Meas. Tech.
ChEMBL_574168 (CHEMBL1060369)
Ki
3.39±n/a nM
Citation
 Giardinà, DMartarelli, DSagratini, GAngeli, PBallinari, DGulini, UMelchiorre, CPoggesi, EPompei, P Doxazosin-related alpha1-adrenoceptor antagonists with prostate antitumor activity. J Med Chem 52:4951-4 (2009)  
Target
Name:
Alpha-1A adrenergic receptor
Synonyms:
ADA1A_HUMAN ADRA1C Alpha 1A-adrenoceptor Alpha adrenergic receptor 1a Alpha-adrenergic receptor 1c adrenergic Alpha1 | adrenergic Alpha1C
Type:
Cell-surface receptors
Mol. Mass.:
51511.67
Organism:
Homo sapiens (Human)
Description:
P35348
Residue:
466
  
Inhibitor
Name:
BDBM50414397
Synonyms:
CHEMBL558890
Type:
Small organic molecule
Emp. Form.:
C27H31N5O5
Mol. Mass.:
505.5655
SMILES:
COc1cc2nc(nc(N)c2cc1OC)N1CCN([C@@H]2CCCC[C@H]12)C(=O)C1COc2ccccc2O1
: