Target
Alpha-1B adrenergic receptor
Ligand
BDBM50414397
Substrate
Meas. Tech.
ChEMBL_574169 (CHEMBL1060370)
Ki
1.41±n/a nM
Citation
 Giardinà, DMartarelli, DSagratini, GAngeli, PBallinari, DGulini, UMelchiorre, CPoggesi, EPompei, P Doxazosin-related alpha1-adrenoceptor antagonists with prostate antitumor activity. J Med Chem 52:4951-4 (2009)  
Target
Name:
Alpha-1B adrenergic receptor
Synonyms:
ADA1B_HUMAN Adrenergic alpha1B Adrenergic receptor alpha Alpha 1B-adrenoreceptor | Alpha-1B adrenergic receptor
Type:
Enzyme
Mol. Mass.:
56862.13
Organism:
Homo sapiens (Human)
Description:
P35368
Residue:
520
  
Inhibitor
Name:
BDBM50414397
Synonyms:
CHEMBL558890
Type:
Small organic molecule
Emp. Form.:
C27H31N5O5
Mol. Mass.:
505.5655
SMILES:
COc1cc2nc(nc(N)c2cc1OC)N1CCN([C@@H]2CCCC[C@H]12)C(=O)C1COc2ccccc2O1
: