Target
Procathepsin L
Ligand
BDBM50414644
Substrate
Meas. Tech.
ChEMBL_581585 (CHEMBL1062472)
IC50
1.26±n/a nM
Citation
 Bethel, PAGerhardt, SJones, EVKenny, PWKaroutchi, GIMorley, ADOldham, KRankine, NAugustin, MKrapp, SSimader, HSteinbacher, S Design of selective Cathepsin inhibitors. Bioorg Med Chem Lett 19:4622-5 (2009)  
Target
Name:
Procathepsin L
Synonyms:
CATL1_HUMAN CTSL CTSL1 Cathepsin L Cathepsin L1 heavy chain MEP cathepsin L preproprotein
Type:
Enzyme
Mol. Mass.:
37557.19
Organism:
Homo sapiens (Human)
Description:
Purchased from Calbiochem (San Diego, CA).
Residue:
333
  
Inhibitor
Name:
BDBM50414644
Synonyms:
CHEMBL555122
Type:
Small organic molecule
Emp. Form.:
C24H30N8O3
Mol. Mass.:
478.5468
SMILES:
Cn1nc(cc1C(=O)NC(Cc1cccc(c1)-c1nnc(CCN)o1)C(=O)NCC#N)C(C)(C)C
: