Target
Adenosine receptor A2a
Ligand
BDBM50415179
Substrate
Meas. Tech.
ChEMBL_601037 (CHEMBL1069174)
Ki
489.78±n/a nM
Citation
 Balo, MCBrea, JCaamaño, OFernández, FGarcía-Mera, XLópez, CLoza, MINieto, MIRodríguez-Borges, JE Synthesis and pharmacological evaluation of novel 1- and 8-substituted-3-furfuryl xanthines as adenosine receptor antagonists. Bioorg Med Chem 17:6755-60 (2009)  
Target
Name:
Adenosine receptor A2a
Synonyms:
A2A adenosine receptor (hA2A) ADENOSINE A2 ADORA2 Adenosine A2A receptor (A2AAR)
Type:
G Protein-Coupled Receptor (GPCR)
Mol. Mass.:
44716.46
Organism:
Homo sapiens (Human)
Description:
P29274
Residue:
412
  
Inhibitor
Name:
BDBM50415179
Synonyms:
CHEMBL603861
Type:
Small organic molecule
Emp. Form.:
C21H20F2N4O4
Mol. Mass.:
430.4047
SMILES:
COCCn1c(=O)n(Cc2ccco2)c2nc(Cc3c(F)cccc3F)n(C)c2c1=O
: