Target
Substance-P receptor
Ligand
BDBM50415266
Substrate
Meas. Tech.
ChEMBL_604256 (CHEMBL1050401)
Ki
100±n/a nM
Citation
 Sabbatini, FMDi Fabio, RGriffante, CPentassuglia, GZonzini, LMelotto, SAlvaro, GCapelli, AMPippo, LPerdona', ESt Denis, YCosta, SCorsi, M Synthesis and pharmacological characterization of constrained analogues of Vestipitant as in vitro potent and orally active NK(1) receptor antagonists. Bioorg Med Chem Lett 20:623-7 (2010)  
Target
Name:
Substance-P receptor
Synonyms:
NK-1 receptor NK1 Receptor NK1R_HUMAN Neurokinin-1 (NK-1) SPR TACR1 Tachykinin receptor 1 (NK1) | tachykinin
Type:
G Protein-Coupled Receptor (GPCR)
Mol. Mass.:
46254.43
Organism:
Homo sapiens (Human)
Description:
P25103
Residue:
407
  
Inhibitor
Name:
BDBM50415266
Synonyms:
CHEMBL591076
Type:
Small organic molecule
Emp. Form.:
C24H25F7N4O
Mol. Mass.:
518.4703
SMILES:
Cc1cc(F)ccc1[C@H]1CNCCN1C(=O)N1CCCNC1c1cc(cc(c1)C(F)(F)F)C(F)(F)F
: