Target
5-hydroxytryptamine receptor 6
Ligand
BDBM50416110
Substrate
Meas. Tech.
ChEMBL_634948 (CHEMBL1117802)
Ki
50.12±n/a nM
Citation
 Reid, MCarlyle, ICaulfield, WLClarkson, TRCusick, FEpemolu, OGilfillan, RGoodwin, RJaap, DO'Donnell, ECPresland, JRankovic, ZSpinks, DSpinks, GThomson, AMThomson, FStrain, JWishart, G The discovery and SAR of indoline-3-carboxamides--a new series of 5-HT6 antagonists. Bioorg Med Chem Lett 20:3713-6 (2010)  
Target
Name:
5-hydroxytryptamine receptor 6
Synonyms:
5-HT-6 5-hydroxytryptamine receptor 6 (5-HT-6) 5-hydroxytryptamine receptor 6 (5HT6) HTR6 Serotonin 6 (5-HT6) receptor | Serotonin Receptor 6
Type:
G Protein-Coupled Receptor (GPCR)
Mol. Mass.:
46968.43
Organism:
Homo sapiens (Human)
Description:
P50406
Residue:
440
  
Inhibitor
Name:
BDBM50416110
Synonyms:
CHEMBL1085836
Type:
Small organic molecule
Emp. Form.:
C32H33N3O4S
Mol. Mass.:
555.687
SMILES:
COc1ccc(c2ccccc12)S(=O)(=O)N1CC(C(=O)NC2CCN(Cc3ccccc3)CC2)c2ccccc12
: