Target
Muscarinic acetylcholine receptor M1
Ligand
BDBM50416141
Substrate
Meas. Tech.
ChEMBL_635221 (CHEMBL1117832)
EC50
0.794±n/a nM
Citation
 Budzik, BGarzya, VShi, DWalker, GLauchart, YLucas, AJRivero, RALangmead, CJWatson, JWu, ZForbes, ITJin, J 2' biaryl amides as novel and subtype selective M1 agonists. Part II: Further optimization and profiling. Bioorg Med Chem Lett 20:3545-9 (2010)  
Target
Name:
Muscarinic acetylcholine receptor M1
Synonyms:
ACM1_HUMAN Cholinergic receptor, muscarinic 1 | Cholinergic, muscarinic M1
Type:
Protein
Mol. Mass.:
51442.54
Organism:
Homo sapiens (Human)
Description:
P11229
Residue:
460
  
Inhibitor
Name:
BDBM50416141
Synonyms:
CHEMBL1083925
Type:
Small organic molecule
Emp. Form.:
C20H22ClFN2O
Mol. Mass.:
360.853
SMILES:
C[C@H]1CNCC[C@@H]1CNC(=O)c1c(F)cccc1-c1cccc(Cl)c1
: