Target
Muscarinic acetylcholine receptor M2
Ligand
BDBM50416728
Substrate
Meas. Tech.
ChEMBL_652864 (CHEMBL1226067)
EC50
>15848.93±n/a nM
Citation
 Johnson, DJForbes, ITWatson, SPGarzya, VStevenson, GIWalker, GRMudhar, HSFlynn, STWyman, PASmith, PWMurkitt, GSLucas, AJMookherjee, CRWatson, JMGartlon, JEBradford, AMBrown, F The discovery of a series of N-substituted 3-(4-piperidinyl)-1,3-benzoxazolinones and oxindoles as highly brain penetrant, selective muscarinic M1 agonists. Bioorg Med Chem Lett 20:5434-8 (2010)  
Target
Name:
Muscarinic acetylcholine receptor M2
Synonyms:
ACM2_HUMAN Cholinergic, muscarinic M2 Muscarinic acetylcholine receptor M2 and M5 | RecName: Full=Muscarinic acetylcholine receptor M2
Type:
GPCR
Mol. Mass.:
51730.61
Organism:
Homo sapiens (Human)
Description:
P08172
Residue:
466
  
Inhibitor
Name:
BDBM50416728
Synonyms:
CHEMBL1223938
Type:
Small organic molecule
Emp. Form.:
C23H34N2O5S
Mol. Mass.:
450.591
SMILES:
CCO[C@H]1CC[C@@](C)(CC1)N1CCC(CC1)n1c2cc(ccc2oc1=O)S(=O)(=O)CC
: