Target
Muscarinic acetylcholine receptor M1
Ligand
BDBM50416738
Substrate
Meas. Tech.
ChEMBL_652863 (CHEMBL1226066)
EC50
1±n/a nM
Citation
 Johnson, DJForbes, ITWatson, SPGarzya, VStevenson, GIWalker, GRMudhar, HSFlynn, STWyman, PASmith, PWMurkitt, GSLucas, AJMookherjee, CRWatson, JMGartlon, JEBradford, AMBrown, F The discovery of a series of N-substituted 3-(4-piperidinyl)-1,3-benzoxazolinones and oxindoles as highly brain penetrant, selective muscarinic M1 agonists. Bioorg Med Chem Lett 20:5434-8 (2010)  
Target
Name:
Muscarinic acetylcholine receptor M1
Synonyms:
ACM1_HUMAN Cholinergic receptor, muscarinic 1 | Cholinergic, muscarinic M1
Type:
Protein
Mol. Mass.:
51442.54
Organism:
Homo sapiens (Human)
Description:
P11229
Residue:
460
  
Inhibitor
Name:
BDBM50416738
Synonyms:
CHEMBL1223860
Type:
Small organic molecule
Emp. Form.:
C22H31FN2O3
Mol. Mass.:
390.4915
SMILES:
CCO[C@H]1CC[C@@](C)(CC1)N1CCC(CC1)n1c2cc(C)c(F)cc2oc1=O
: