Target
D(2) dopamine receptor
Ligand
BDBM50417320
Substrate
Meas. Tech.
ChEMBL_685575 (CHEMBL1285353)
IC50
1.7±n/a nM
Citation
 Fatemi, MHDorostkar, F QSAR prediction of D2 receptor antagonistic activity of 6-methoxy benzamides. Eur J Med Chem 45:4856-62 (2010)  
Target
Name:
D(2) dopamine receptor
Synonyms:
D(2) dopamine receptor DOPAMINE D2 Long DRD2 Dopamine D2 receptor Dopamine D2 receptor (D2R) Dopamine2-like | d2
Type:
Cell-surface receptors
Mol. Mass.:
50647.10
Organism:
Homo sapiens (Human)
Description:
P14416
Residue:
443
  
Inhibitor
Name:
BDBM50417320
Synonyms:
CHEMBL1276712
Type:
Small organic molecule
Emp. Form.:
C16H23ClN2O4
Mol. Mass.:
342.818
SMILES:
CCN1CCC[C@H]1CNC(=O)c1c(OC)c(O)cc(Cl)c1OC
: