Target
5-hydroxytryptamine receptor 1A
Ligand
BDBM50417411
Substrate
Meas. Tech.
ChEMBL_686385 (CHEMBL1293141)
Ki
0.631±n/a nM
Citation
 Bromidge, SMArban, RBertani, BBorriello, MCapelli, AMDi-Fabio, RFaedo, SGianotti, MGordon, LJGranci, EPasquarello, ASpada, SKWorby, AZonzini, LZucchelli, V 5-{2-[4-(2-methyl-5-quinolinyl)-1-piperazinyl]ethyl}-2(1H)-quinolinones and 3,4-dihydro-2(1H)-quinolinones: dual-acting 5-HT1 receptor antagonists and serotonin reuptake inhibitors. Part 3. Bioorg Med Chem Lett 20:7092-6 (2010)  
Target
Name:
5-hydroxytryptamine receptor 1A
Synonyms:
5-HT-1A 5-hydroxytryptamine receptor 1A (5-HT-1A) ADRB2RL1 Dopamine D2 receptor and serotonin 1a receptor HTR1A | Serotonin receptor 1A
Type:
Mol. Mass.:
46122.49
Organism:
Homo sapiens (Human)
Description:
Residue:
422
  
Inhibitor
Name:
BDBM50417411
Synonyms:
CHEMBL1290715
Type:
Small organic molecule
Emp. Form.:
C25H26N4O
Mol. Mass.:
398.5001
SMILES:
Cc1ccc2c(cccc2n1)N1CCN(CCc2cccc3[nH]c(=O)ccc23)CC1
: