Target
Transcriptional regulator ERG
Ligand
BDBM50417411
Substrate
Meas. Tech.
ChEMBL_686392 (CHEMBL1293148)
Ki
>31622.78±n/a nM
Citation
 Bromidge, SMArban, RBertani, BBorriello, MCapelli, AMDi-Fabio, RFaedo, SGianotti, MGordon, LJGranci, EPasquarello, ASpada, SKWorby, AZonzini, LZucchelli, V 5-{2-[4-(2-methyl-5-quinolinyl)-1-piperazinyl]ethyl}-2(1H)-quinolinones and 3,4-dihydro-2(1H)-quinolinones: dual-acting 5-HT1 receptor antagonists and serotonin reuptake inhibitors. Part 3. Bioorg Med Chem Lett 20:7092-6 (2010)  
Target
Name:
Transcriptional regulator ERG
Synonyms:
ERG Transforming protein ERG
Type:
PROTEIN
Mol. Mass.:
54615.84
Organism:
Homo sapiens (Human)
Description:
ChEMBL_1335569
Residue:
486
  
Inhibitor
Name:
BDBM50417411
Synonyms:
CHEMBL1290715
Type:
Small organic molecule
Emp. Form.:
C25H26N4O
Mol. Mass.:
398.5001
SMILES:
Cc1ccc2c(cccc2n1)N1CCN(CCc2cccc3[nH]c(=O)ccc23)CC1
: