Target
5-hydroxytryptamine receptor 1B
Ligand
BDBM50413549
Substrate
Meas. Tech.
ChEMBL_686386 (CHEMBL1293142)
Ki
1±n/a nM
Citation
 Bromidge, SMArban, RBertani, BBorriello, MCapelli, AMDi-Fabio, RFaedo, SGianotti, MGordon, LJGranci, EPasquarello, ASpada, SKWorby, AZonzini, LZucchelli, V 5-{2-[4-(2-methyl-5-quinolinyl)-1-piperazinyl]ethyl}-2(1H)-quinolinones and 3,4-dihydro-2(1H)-quinolinones: dual-acting 5-HT1 receptor antagonists and serotonin reuptake inhibitors. Part 3. Bioorg Med Chem Lett 20:7092-6 (2010)  
Target
Name:
5-hydroxytryptamine receptor 1B
Synonyms:
5-HT-1B 5-HT1B 5HT1B_HUMAN HTR1DB Serotonin (5-HT) receptor Serotonin Receptor 1B
Type:
G Protein-Coupled Receptor (GPCR)
Mol. Mass.:
43579.17
Organism:
Homo sapiens (Human)
Description:
Receptor binding assays were performed using human clone stably expressed in CHO cells
Residue:
390
  
Inhibitor
Name:
BDBM50413549
Synonyms:
CHEMBL513715
Type:
Small organic molecule
Emp. Form.:
C24H26N4O2
Mol. Mass.:
402.4888
SMILES:
Cc1ccc2c(cccc2n1)N1CCN(CCc2cccc3NC(=O)COc23)CC1
: